[Qgis-developer] build error

Marco Cecchetti mrc.ildp at gmail.com
Sat Nov 29 08:55:49 EST 2008

I hope this is the right place to submit this issue:

I'm trying to build qgis package for slackware and I get this error with new
versions for pyqt and sip (pyqt4-4.4.4, sip-4.7.9)

[ 71%] Generating core/core.so
sipcoreQgsGeometry.cpp: In function 'PyObject*
meth_QgsGeometry_setWkbAndOwnership(PyObject*, PyObject*)':
sipcoreQgsGeometry.cpp:328: error: 'size_t' is not a member of
'QgsGeometry' sipcoreQgsGeometry.cpp:328: error: expected `;' before
'a1' sipcoreQgsGeometry.cpp:331: error: 'a1' was not declared in this
scope sipcoreQgsGeometry.cpp: In function 'PyObject*
meth_QgsGeometry_wkbSize(PyObject*, PyObject*)':
sipcoreQgsGeometry.cpp:395: error: 'size_t' is not a member of
'QgsGeometry' sipcoreQgsGeometry.cpp:395: error: expected `;' before
'sipRes' sipcoreQgsGeometry.cpp:398: error: 'sipRes' was not declared
in this scope sipcoreQgsGeometry.cpp:401: error: 'sipRes' was not
declared in this scope gmake[3]: *** [sipcoreQgsGeometry.o] Error 1
make[2]: *** [python/core/core.so] Error 2 make[1]: ***
[python/CMakeFiles/python.dir/all] Error 2 make: *** [all] Error 2

Building qgis with old versions sip-4.7.7 and pyqt4-4.4.3 it looks to work

-------------- next part --------------
An HTML attachment was scrubbed...
URL: http://lists.osgeo.org/pipermail/qgis-developer/attachments/20081129/5dcad13d/attachment.html

More information about the Qgis-developer mailing list