[Qgis-developer] Compile error: class ???QgisApp??? does not have any field named ???mProxyFactory???

Paolo Cavallini cavallini at faunalia.it
Mon Apr 12 13:42:52 EDT 2010

Jürgen E. Fischer ha scritto:
> Hi Niccolo,
> On Mon, 12. Apr 2010 at 10:55:48 +0200, Niccolo Rigacci wrote:
>> Now rev 13300 fails, with this error:
> Right, try >=r13301.

Checked again, and I get:

[ 57%] Building CXX object src/app/CMakeFiles/qgis.dir/qrc_images.cxx.o

make[3]: *** No rule to make target `/usr/lib/libspatialite.so', needed by
`src/app/qgis'.  Stop.
make[3]: Leaving directory `/storage/build/qgis_unstable/debian/build'

make[2]: *** [src/app/CMakeFiles/qgis.dir/all] Error 2

make[2]: Leaving directory `/storage/build/qgis_unstable/debian/build'

make[1]: *** [all] Error 2

make[1]: Leaving directory `/storage/build/qgis_unstable/debian/build'

make: *** [build-stamp] Error 2

dpkg-buildpackage: error: debian/rules build gave error exit status 2

both wirth internal and external spatialite.
All on Debian unstable, up to date.
Paolo Cavallini: http://www.faunalia.it/pc

More information about the Qgis-developer mailing list