[Qgis-developer] compiling on Ubuntu error

Giovanni Manghi giovanni.manghi at gmail.com
Thu Apr 22 15:16:20 EDT 2010

Hi all,

it is a few days already that I can't compile qgis-trunk on ubuntu, can
someone give me an hint?

thanks in advance

-- Giovanni --

[ 43%] Building CXX object
In file included
from /home/gio/qgis_unstable/src/app/qgsnewspatialitelayerdialog.cpp:22:
error: spatialite.h: No such file or directory
/home/gio/qgis_unstable/src/app/qgsnewspatialitelayerdialog.cpp: In
member function ‘bool QgsNewSpatialiteLayerDialog::apply()’:
error: ‘spatialite_init’ was not declared in this scope
make[3]: ***
[src/app/CMakeFiles/qgis.dir/qgsnewspatialitelayerdialog.cpp.o] Error 1
make[3]: Leaving directory `/home/gio/qgis_unstable/debian/build'
make[2]: *** [src/app/CMakeFiles/qgis.dir/all] Error 2
make[2]: Leaving directory `/home/gio/qgis_unstable/debian/build'
make[1]: *** [all] Error 2
make[1]: Leaving directory `/home/gio/qgis_unstable/debian/build'
make: *** [build-stamp] Error 2
dpkg-buildpackage: failure: debian/rules build gave error exit status 2

More information about the Qgis-developer mailing list