[OSGeo-Discuss] snafu while compiling geos 3.0.3 on a Mac/Intel/10.5.6

P Kishor punk.kish at gmail.com
Sun Feb 22 16:41:49 PST 2009

g++  -o .libs/_geos.so -bundle  .libs/_geos_la-geos_wrap.o
-L/usr/local/lib/python2.6/config/ -lpython2.6
Undefined symbols:
  "_environ", referenced from:
      _environ$non_lazy_ptr in libpython2.6.a(posixmodule.o)
ld: symbol(s) not found
collect2: ld returned 1 exit status
make[4]: *** [_geos.la] Error 1
make[3]: *** [all-recursive] Error 1
make[2]: *** [all] Error 2
make[1]: *** [all-recursive] Error 1
make: *** [all-recursive] Error 1
[06:38 PM] ~/Projects/geos-3.0.3$

uh oh! What to do now?

Puneet Kishor

More information about the Discuss mailing list