[geos-devel] error1

Michel Garand garand at odragis.org
Tue Dec 14 03:46:23 EST 2004


I tried compiling geos-2.1-0 on a debian machine and got an error

Can anyone help me with this error
Node.cpp -Wp,-MD,.deps/QuadTreeNode.TPlo  -fPIC -DPIC -o
../index/quadtree/QuadTreeNode.cpp: In method `class string
geos::QuadTreeNode::toString() const':
../index/quadtree/QuadTreeNode.cpp:175: implicit declaration of function
`int geos::sprintf(...)'
make[2]: *** [QuadTreeNode.lo] Error 1
make[2]: Leaving directory `/home/michel/gis/src/geos-2.1.0/source/geom'
make[1]: *** [all-recursive] Error 1
make[1]: Leaving directory `/home/michel/gis/src/geos-2.1.0/source'
make: *** [all-recursive] Error 1

Thanks in advance for any assistance


More information about the geos-devel mailing list