[GRASS-dev] problem with building grass71 on launchpad

Martin Landa landa.martin at gmail.com
Tue Jan 6 00:18:10 PST 2015

Hi all,

I trying to solve problem with compiling grass71 on Launchpad, but
unfortunately without success till now. Strangely grass71 fails [1]
even it uses completely same rules as grass70 which doesn't fail [2].
The critical place is:

install -m 755 tools/mkhtml.py \
install: cannot create regular file
'debian/grass71-dev/usr/lib/grass71/tools/mkhtml.py': No such file or
debian/rules:134: recipe for target 'install' failed
make: *** [install] Error 1
dpkg-buildpackage: error: /usr/bin/fakeroot debian/rules binary-arch
gave error exit status 2

Does anybody here any idea what could be wrong? Thanks in advance, Martin

[1] https://launchpadlibrarian.net/194101693/buildlog_ubuntu-utopic-amd64.grass71_7.1.0%2B1svn63952~ubuntu14.10.1_FAILEDTOBUILD.txt.gz
[2] https://launchpadlibrarian.net/194104129/buildlog_ubuntu-utopic-amd64.grass70_7.0.0%2B1svn63953~ubuntu14.10.1_UPLOADING.txt.gz

Martin Landa

More information about the grass-dev mailing list