[postgis-devel] [PostGIS] #1550: Error: tin_tgeom

PostGIS trac at osgeo.org
Tue Feb 7 14:58:00 PST 2012

#1550: Error: tin_tgeom
 Reporter:  aperi2007              |       Owner:  strk         
     Type:  defect                 |      Status:  new          
 Priority:  medium                 |   Milestone:  PostGIS 2.0.0
Component:  build/upgrade/install  |     Version:  trunk        
 Keywords:                         |  
 Hi, compiling on debian 6.0.4 64bit.
 I'm having this error in the check phase.

      CUnit - A Unit testing framework for C - Version 2.1-0
   Test: test_ptarray_point_in_ring ... passed
 Suite: GEOS
   Test: test_geos_noop ... passed
 Suite: surface
   Test: triangle_parse ... passed
   Test: tin_parse ... passed
   Test: polyhedralsurface_parse ... passed
   Test: tin_tgeom ... make[2]: *** [check] Segmentation fault
 make[2]: Leaving directory `/home/postgres/software/postgis/postgis-
 make[1]: *** [check] Error 2
 make[1]: Leaving directory `/home/postgres/software/postgis/postgis-
 make: *** [check] Error 1


 I don't understand more on this error.
 Never seen before.

 It seem don't generate any log file.

Ticket URL: <http://trac.osgeo.org/postgis/ticket/1550>
PostGIS <http://trac.osgeo.org/postgis/>
The PostGIS Trac is used for bug, enhancement & task tracking, a user and developer wiki, and a view into the subversion code repository of PostGIS project.

More information about the postgis-devel mailing list