[QGIS-Developer] build error 2.18/Debian at end

Richard Duivenvoorde rdmailings at duif.net
Sat Aug 18 06:26:21 PDT 2018

Just upgraded to Debian testing, updated libs etc, reconfigured, and
build goes fine untill the last 100% :

Scanning dependencies of target pyyaml
[100%] Built target pyyaml
Scanning dependencies of target pymarkupsafe
[100%] Built target pymarkupsafe
Scanning dependencies of target pyfuture
Error copying directory from "_dummy_thread" to
make[2]: *** [python/ext-libs/CMakeFiles/pyfuture.dir/build.make:57:
pyfuture] Error 1
make[1]: *** [CMakeFiles/Makefile2:8976:
python/ext-libs/CMakeFiles/pyfuture.dir/all] Error 2
make: *** [Makefile:152: all] Error 2

both source and target dir seem available and writable (to myself)

Anybody seeing this? Or has another clue?


Richard Duivenvoorde

More information about the QGIS-Developer mailing list